{"text_format":"1","workbook":"xlsx","n_sheets":12,"sheets":["ТИТУЛ","РОЗПОДІЛ","НАВЧАЛЬНА РОБОТА","МЕТОД+НАУК+ОРГАН","ЗМІНИ ТА ВИСНОВКИ","метод","наук","органз","СПИСКИ","Лист2","Лист3","Лист4"],"not_rendered":{"charts":0,"images":0,"macros":1,"external_links":0,"defined_names":23,"comments":0,"pivot_tables":0},"unopened":[],"bounds":{"document_bytes":16777216,"sheet_cells":100000,"rows_first":2000,"rows_last":500,"rows_between":2000,"halvings":0,"cell_chars":16384,"cell_head_chars":4096},"cells_cut":0,"cells_raw":0,"read":"whole","date_system":"1900"}

{"sheet":"ТИТУЛ","index":0,"n_rows":36,"n_cols":14,"rows_kept":36,"cut":false,"hidden":false,"merged":[[0,0,0,6],[18,0,18,6],[19,0,19,6],[23,0,23,6],[10,0,11,0],[8,1,8,5],[11,1,11,5],[32,5,32,6],[33,5,33,6],[7,12,8,12],[7,13,8,13],[11,12,12,12],[11,13,12,13],[23,12,24,12],[23,13,24,13],[33,12,34,12],[24,0,24,6]]}
["МІНІСТЕРСТВО ОСВІТИ І НАУКИ УКРАЇНИ                                                                                                                     ХАРКІВСЬКИЙ НАЦІОНАЛЬНИЙ ЕКОНОМІЧНИЙ УНІВЕРСИТЕТ                                      ІМЕНІ СЕМЕНА КУЗНЕЦЯ"]
[null,null,null,null,null,null,null,{"$f":"VLOOKUP(B9,СПИСКИ!$A$3:$B$9,2,FALSE)","v":201},{"$f":"VLOOKUP(H2,СПИСКИ!$D$3:$E$37,2,FALSE)","v":"Фінансів"},1,"2017 / 2018",{"$f":"IFERROR(I2,\" \")","v":"Фінансів"}]
[null,null,null,null,null,null,null,{"$f":"H2+1","v":202},{"$f":"VLOOKUP(H3,СПИСКИ!$D$3:$E$37,2,FALSE)","v":"Банківської справи і фінансових послуг"},0.75,"2018/ 2019","Банківської справи і фінансових послуг"]
[null,null,null,null,null,null,null,{"$f":"H3+1","v":203},{"$f":"VLOOKUP(H4,СПИСКИ!$D$3:$E$37,2,FALSE)","v":"Митної справи"},0.5,"2019/ 2020","Митної справи"]
[null,null,null,null,null,null,null,204,{"$f":"VLOOKUP(H5,СПИСКИ!$D$3:$E$37,2,FALSE)","v":"Обліку і бізнес-консалтингу"},0.25,"2020 / 2021","Обліку і бізнес-консалтингу"]
[null,null,null,null,null,null,null,205,{"$f":"VLOOKUP(H6,СПИСКИ!$D$3:$E$37,2,FALSE)","v":"Вищої математики та економіко-математичних методів"},null,"2021/2022","Вищої математики та економіко-математичних методів"]
[null,null,null,null,null,null,null,206,{"$f":"VLOOKUP(H7,СПИСКИ!$D$3:$E$37,2,FALSE)","v":{"$error":"#N/A"}},null,"2022/2023"," "]
[null,null,null,null,null,null,null,null,null,null,"2023/2024",null,"E","Вибрати з випадаючого списку"]
["Факультет","Фінансів і обліку"]
[]
["Кафедра"]
[null,"Фінансів",null,null,null,null,null,null,null,null,null,null,"E","Вибрати з випадаючого списку"]
[]
[]
[]
[]
[]
[]
["ІНДИВІДУАЛЬНИЙ ПЛАН"]
["РОБОТИ ВИКЛАДАЧА ТА ЇЇ ОБЛІК"]
{"$rows_left_out":17}
{"sheet":"РОЗПОДІЛ","index":1,"n_rows":25,"n_cols":8,"rows_kept":25,"cut":false,"hidden":false,"merged":[[24,6,25,6],[24,7,25,7],[26,0,26,4],[10,0,10,4],[12,0,12,4],[13,0,13,2],[14,0,14,2],[16,0,16,2],[17,0,17,2],[18,0,18,2],[15,0,15,2],[21,0,21,4],[22,0,22,4],[8,0,8,4],[24,0,24,1],[0,2,1,4],[2,1,2,4],[3,0,3,4],[4,0,4,4],[5,0,5,4],[9,0,9,4]]}
[]
[null,null,null,null,null,null,{"$f":"ТИТУЛ!E34*1548","v":0}," - загальна кількость годин"]
[]
[]
[]
[]
[]
[]
[]
[]
["РОЗПОДІЛ ЗАГАЛЬНОГО РОБОЧОГО ЧАСУ"]
[]
["Повний обсяг роботи за індивідуальним планом:"]
["За видами робіт:",null,null,"План","Факт"]
["І. Навчальна",null,null,{"$f":"'НАВЧАЛЬНА РОБОТА'!AO69","v":0},{"$f":"'НАВЧАЛЬНА РОБОТА'!AP69","v":0}]
["ІІ. Методична",null,null,{"$f":"'МЕТОД+НАУК+ОРГАН'!E18","v":0},{"$f":"'МЕТОД+НАУК+ОРГАН'!F18","v":0}]
["ІII. Наукова",null,null,{"$f":"'МЕТОД+НАУК+ОРГАН'!E30","v":0},{"$f":"'МЕТОД+НАУК+ОРГАН'!F30","v":0}]
["IV. Організаційно-виховна",null,null,{"$f":"'МЕТОД+НАУК+ОРГАН'!E39","v":0},{"$f":"'МЕТОД+НАУК+ОРГАН'!F39","v":0}]
["Загальна кількість годин",null,null,{"$f":"SUM(D15:D18)","v":0},{"$f":"SUM(E15:E18)","v":0},null,{"$f":"G2-D19","v":0},{"$f":"IF(G19=0,0,\"- відхілення від норматива\")","v":0}]
[]
{"$rows_left_out":6}
{"sheet":"НАВЧАЛЬНА РОБОТА","index":2,"n_rows":73,"n_cols":44,"rows_kept":73,"cut":false,"hidden":false,"merged":[[1,4,3,4],[1,18,2,19],[4,0,20,0],[1,14,2,15],[20,1,20,7],[1,8,2,9],[1,1,3,1],[1,2,3,2],[1,3,3,3],[1,5,3,5],[1,6,3,6],[1,16,2,17],[1,10,2,11],[1,12,2,13],[1,7,3,7],[1,0,3,0],[71,20,71,21],[71,25,71,29],[1,30,2,31],[1,34,2,35],[64,16,64,41],[67,16,67,41],[1,38,2,39],[1,40,2,41],[1,36,2,37],[1,20,1,25],[1,26,2,27],[1,28,2,29],[2,20,2,21],[2,22,2,23],[2,24,2,25],[1,32,2,33],[32,1,32,7],[21,0,32,0],[34,0,50,0],[68,0,68,7],[33,0,33,7],[63,0,63,7],[64,0,64,15],[67,0,67,15],[65,0,65,7],[66,0,66,7],[51,0,62,0],[50,1,50,7],[62,1,62,7]]}
["І. НАВЧАЛЬНА РОБОТА"]
["Форма навчання","№ п/п","Назва навчальних дисциплін                                                                             і видів навчальної роботи","Напрям, спеціальність, факультет","Мова навчання","Курс навчання","Кількість студентів","Шифр груп (потоків)","Читання лекцій",null,"Проведення практичних (семінарських) занять",null,"Проведення лабораторних занять",null,"Проведення консультацій протягом семестру",null,"Проведення екзаменаційних консультацій",null,"Перевірка контрольних робіт",null,"Керівництво і прийняття індивідуальних завдань",null,null,null,null,null,"Проведення заліку",null,"Проведення семестрових екзаменів",null,"Керівництво навчальною                  і виробничою практикою",null,"участь в ДЕК",null,"Проведення державних екзаменів",null,"Керівництво, консультування, рецензування та проведення захисту дипломних проектів (робіт)",null,"Керівництво аспірантами, здобувачами та стажуванням викладачів",null,"УСЬОГО"]
[null,null,null,null,null,null,null,null,null,null,null,null,null,null,null,null,null,null,null,null,"рефератів, аналітичних оглядів, перекладів",null,"розрахункових, графіч-них, розрахунково-графічних робіт",null,"курсових проектів, робіт "]
[null,null,null,null,null,null,null,null,"пл.","вик.","пл.","вик.","пл.","вик.","пл.","вик.","пл.","вик.","пл.","вик.","пл.","вик.","пл.","вик.","пл.","вик.","пл.","вик.","пл.","вик.","пл.","вик.","пл.","вик.","пл.","вик.","пл.","вик.","пл.","вик.","пл.","вик."]
["денна",{"$f":"IF(C5=0,0,1)","v":0},null,null,null,null,null,null,null,null,null,null,null,null,null,null,null,null,null,null,null,null,null,null,null,null,null,null,null,null,null,null,null,null,null,null,null,null,null,null,{"$f":"I5+K5+M5+O5+Q5+S5+U5+W5+Y5+AA5+AC5+AE5+AG5+AI5+AK5+AM5","v":0},{"$f":"J5+L5+N5+P5+R5+T5+V5+X5+Z5+AB5+AD5+AF5+AH5+AJ5+AL5+AN5","v":0}]
[null,2,null,null,null,null,null,null,null,null,null,null,null,null,null,null,null,null,null,null,null,null,null,null,null,null,null,null,null,null,null,null,null,null,null,null,null,null,null,null,{"$f":"I6+K6+M6+O6+Q6+S6+U6+W6+Y6+AA6+AC6+AE6+AG6+AI6+AK6+AM6","v":0},{"$f":"J6+L6+N6+P6+R6+T6+V6+X6+Z6+AB6+AD6+AF6+AH6+AJ6+AL6+AN6","v":0}]
[null,{"$f":"IF(C7=0,0,1)","v":0},null,null,null,null,null,null,null,null,null,null,null,null,null,null,null,null,null,null,null,null,null,null,null,null,null,null,null,null,null,null,null,null,null,null,null,null,null,null,0,0]
[null,0,null,null,null,null,null,null,null,null,null,null,null,null,null,null,null,null,null,null,null,null,null,null,null,null,null,null,null,null,null,null,null,null,null,null,null,null,null,null,0,0]
[null,0,null,null,null,null,null,null,null,null,null,null,null,null,null,null,null,null,null,null,null,null,null,null,null,null,null,null,null,null,null,null,null,null,null,null,null,null,null,null,0,0]
[null,0,null,null,null,null,null,null,null,null,null,null,null,null,null,null,null,null,null,null,null,null,null,null,null,null,null,null,null,null,null,null,null,null,null,null,null,null,null,null,0,0]
[null,0,null,null,null,null,null,null,null,null,null,null,null,null,null,null,null,null,null,null,null,null,null,null,null,null,null,null,null,null,null,null,null,null,null,null,null,null,null,null,0,0]
[null,0,null,null,null,null,null,null,null,null,null,null,null,null,null,null,null,null,null,null,null,null,null,null,null,null,null,null,null,null,null,null,null,null,null,null,null,null,null,null,0,{"$f":"J12+L12+N12+P12+R12+T12+V12+X12+Z12+AB12+AD12+AF12+AH12+AJ12+AL12+AN12","v":0}]
[null,0,null,null,null,null,null,null,null,null,null,null,null,null,null,null,null,null,null,null,null,null,null,null,null,null,null,null,null,null,null,null,null,null,null,null,null,null,null,null,0,0]
[null,0,null,null,null,null,null,null,null,null,null,null,null,null,null,null,null,null,null,null,null,null,null,null,null,null,null,null,null,null,null,null,null,null,null,null,null,null,null,null,0,0]
[null,0,null,null,null,null,null,null,null,null,null,null,null,null,null,null,null,null,null,null,null,null,null,null,null,null,null,null,null,null,null,null,null,null,null,null,null,null,null,null,0,0]
[null,0,null,null,null,null,null,null,null,null,null,null,null,null,null,null,null,null,null,null,null,null,null,null,null,null,null,null,null,null,null,null,null,null,null,null,null,null,null,null,0,0]
[null,0,null,null,null,null,null,null,null,null,null,null,null,null,null,null,null,null,null,null,null,null,null,null,null,null,null,null,null,null,null,null,null,null,null,null,null,null,null,null,0,0]
[null,0,null,null,null,null,null,null,null,null,null,null,null,null,null,null,null,null,null,null,null,null,null,null,null,null,null,null,null,null,null,null,null,null,null,null,null,null,null,null,0,0]
[null,0,null,null,null,null,null,null,null,null,null,null,null,null,null,null,null,null,null,null,null,null,null,null,null,null,null,null,null,null,null,null,null,null,null,null,null,null,null,null,0,0]
[null,0,null,null,null,null,null,null,null,null,null,null,null,null,null,null,null,null,null,null,null,null,null,null,null,null,null,null,null,null,null,null,null,null,null,null,null,null,null,null,0,0]
{"$rows_left_out":54}
{"sheet":"МЕТОД+НАУК+ОРГАН","index":3,"n_rows":40,"n_cols":7,"rows_kept":40,"cut":false,"hidden":false,"merged":[[18,1,18,4],[30,1,30,4],[39,1,39,4]]}
[null,"II.  МЕТОДИЧНА   РОБОТА"]
["№   п/п","Зміст","Підсумковий результат","Термін виконання","Плановий обсяг,                                год","Фактичний обсяг,                    год","ВВЕДІТЬ НОМЕР\nВІД 1-101"]
[{"$f":"IF(B3=0,0,1)","v":1},{"$f":"IFERROR(VLOOKUP(G3,метод!$C$14:$D$114,2,FALSE),\" \")","v":" "}]
[{"$f":"IF(B4=\" \",\" \",A3+1)","v":" "},{"$f":"IFERROR(VLOOKUP(G4,метод!$C$14:$D$114,2,FALSE),\" \")","v":" "}]
[{"$f":"IF(B5=\" \",\" \",A4+1)","v":" "},{"$f":"IFERROR(VLOOKUP(G5,метод!$C$14:$D$114,2,FALSE),\" \")","v":" "}]
[" ",{"$f":"IFERROR(VLOOKUP(G6,метод!$C$14:$D$114,2,FALSE),\" \")","v":" "}]
[" ",{"$f":"IFERROR(VLOOKUP(G7,метод!$C$14:$D$114,2,FALSE),\" \")","v":" "}]
[" ",{"$f":"IFERROR(VLOOKUP(G8,метод!$C$14:$D$114,2,FALSE),\" \")","v":" "}]
[{"$f":"IF(B9=\" \",\" \",A8+1)","v":" "},{"$f":"IFERROR(VLOOKUP(G9,метод!$C$14:$D$114,2,FALSE),\" \")","v":" "}]
[" ",{"$f":"IFERROR(VLOOKUP(G10,метод!$C$14:$D$114,2,FALSE),\" \")","v":" "}]
[" ",{"$f":"IFERROR(VLOOKUP(G11,метод!$C$14:$D$114,2,FALSE),\" \")","v":" "}]
[{"$f":"IF(B12=\" \",\" \",A11+1)","v":" "},{"$f":"IFERROR(VLOOKUP(G12,метод!$C$14:$D$114,2,FALSE),\" \")","v":" "}]
[" ",{"$f":"IFERROR(VLOOKUP(G13,метод!$C$14:$D$114,2,FALSE),\" \")","v":" "}]
[" ",{"$f":"IFERROR(VLOOKUP(G14,метод!$C$14:$D$114,2,FALSE),\" \")","v":" "}]
[" ",{"$f":"IFERROR(VLOOKUP(G15,метод!$C$14:$D$114,2,FALSE),\" \")","v":" "}]
[{"$f":"IF(B16=\" \",\" \",A15+1)","v":" "},{"$f":"IFERROR(VLOOKUP(G16,метод!$C$14:$D$114,2,FALSE),\" \")","v":" "}]
[" ",{"$f":"IFERROR(VLOOKUP(G17,метод!$C$14:$D$114,2,FALSE),\" \")","v":" "}]
[null,null,null,"Загальна кількість годин",{"$f":"SUM(E3:E17)","v":0},{"$f":"SUM(F3:F17)","v":0}]
[null,{"$f":"CONCATENATE(\"Викладач ______________      Завідувач кафедри  ____________       / \",'НАВЧАЛЬНА РОБОТА'!AR71,\" /\")","v":"Викладач ______________      Завідувач кафедри  ____________       / Журавльова І.В. /"}]
[null,"ІІІ. НАУКОВА РОБОТА"]
{"$rows_left_out":21}
{"sheet":"ЗМІНИ ТА ВИСНОВКИ","index":4,"n_rows":21,"n_cols":7,"rows_kept":21,"cut":false,"hidden":false,"merged":[[22,1,22,5],[19,0,19,6],[0,0,0,5],[11,1,11,5],[12,1,12,5],[13,1,13,5],[14,1,14,5],[10,0,10,6],[15,1,15,5],[16,1,16,5],[17,1,17,5],[20,1,20,5],[21,1,21,5],[23,1,23,5],[24,1,24,5],[25,1,25,5],[26,1,26,5],[27,1,27,5]]}
["V. ПЕРЕЛІК ЗМІН У ПЛАНІ РОБОТИ ВИКЛАДАЧА"]
["Семестр","Види робіт","Сутність запроваджених змін                                   та їх обґрунтування","Плановий обсяг,                                год","Фактичний обсяг,                    год","Підстава                                                  (накази, розпорядження, протоколи засідань кафедри, лікарняні листи)","Підпис  завідувача кафедри"]
[]
[]
[]
[]
[]
[]
[]
[]
["VI.  ВИСНОВОК ПРО ВИКОНАННЯ ПЛАНУ"]
["Семестр","Зміст",null,null,null,null,"Підпис  завідувача кафедри"]
[null,{"$f":"CONCATENATE(\"Звіт про виконання індивідуального плану за \",ТИТУЛ!A34,\" навчальний рік викладача \",ТИТУЛ!A24,\" розглянуто ___  _____________ 20__ р. на засіданні кафедри \",ТИТУЛ!B12,\" й ухвалено рішення (протокол №______): Індивідуальний план виконано в обсязі \",РОЗПОДІЛ!E19,\" годин.\")","v":"Звіт про виконання індивідуального плану за 2021/2022 навчальний рік викладача  розглянуто ___  _____________ 20__ р. на засіданні кафедри Фінансів й ухвалено рішення (протокол №______): Індивідуальний план виконано в обсязі 0 годин."}]
[null,"Пояснення щодо причин недовиконання:"]
[]
[]
[]
[]
[]
["VII. ЗАУВАЖЕННЯ ОСІБ, ЯКІ ПЕРЕВІРЯЮТЬ РОБОТУ КАФЕДРИ "]
{"$rows_left_out":2}
{"sheet":"метод","index":5,"n_rows":114,"n_cols":4,"rows_kept":114,"cut":false,"hidden":false,"merged":[]}
[]
["ПП","ПЕРЕЛІК МЕТОДИЧНИХ РОБІТ","номер"]
[]
[]
[]
[]
[]
[]
[]
[]
[]
[]
["ПП","ПЕРЕЛІК МЕТОДИЧНИХ РОБІТ","номер"]
["1.1.1.1","Підготовка конспектів лекцій: за новою дисципліною",1,{"$f":"CONCATENATE(A14,\" \", B14)","v":"1.1.1.1 Підготовка конспектів лекцій: за новою дисципліною"}]
["1.1.1.2","Підготовка конспектів лекцій: оновлення конспекту лекцій",2,{"$f":"CONCATENATE(A15,\" \", B15)","v":"1.1.1.2 Підготовка конспектів лекцій: оновлення конспекту лекцій"}]
["1.1.2.1","Підготовка конспектів лекцій іноземною мовою: за новою дисципліною",3,"1.1.2.1 Підготовка конспектів лекцій іноземною мовою: за новою дисципліною"]
["1.1.2.2","Підготовка конспектів лекцій іноземною мовою:оновлення конспекту лекцій",4,"1.1.2.2 Підготовка конспектів лекцій іноземною мовою:оновлення конспекту лекцій"]
["1.1.3","Підготовка засобів активізації навчально-пізнавальної діяльності (технічної візуалізації)",5,"1.1.3 Підготовка засобів активізації навчально-пізнавальної діяльності (технічної візуалізації)"]
["1.1.4.1","Підготовка методичних матеріалів семінарських, практичних, лабораторних занять:за новою дисципліною",6,"1.1.4.1 Підготовка методичних матеріалів семінарських, практичних, лабораторних занять:за новою дисципліною"]
["1.1.4.2","Підготовка методичних матеріалів семінарських, практичних, лабораторних занять: оновлення методичних матеріалів",7,"1.1.4.2 Підготовка методичних матеріалів семінарських, практичних, лабораторних занять: оновлення методичних матеріалів"]
{"$rows_left_out":95}
{"sheet":"наук","index":6,"n_rows":67,"n_cols":4,"rows_kept":67,"cut":false,"hidden":false,"merged":[]}
[]
["ПП","ПЕРЕЛІК НАУКОВИХ РОБІТ","номер"]
[]
[]
[]
[]
[]
[]
[]
[]
[]
[]
["ПП","ПЕРЕЛІК НАУКОВИХ РОБІТ","номер"]
["1.1.1","Виконання планових наукових досліджень: керівнику",102,{"$f":"CONCATENATE(A14,\" \",B14)","v":"1.1.1 Виконання планових наукових досліджень: керівнику"}]
["1.1.2","Виконання планових наукових досліджень: виконавцю",103,{"$f":"CONCATENATE(A15,\" \",B15)","v":"1.1.2 Виконання планових наукових досліджень: виконавцю"}]
["1.2.1","Розробка інноваційно-дослідницьких проектів: керівнику",104,"1.2.1 Розробка інноваційно-дослідницьких проектів: керівнику"]
["1.2.2","Розробка інноваційно-дослідницьких проектів: виконавцю",105,"1.2.2 Розробка інноваційно-дослідницьких проектів: виконавцю"]
["2.1.1","Винахідницька робота викладача: міжнародні патенти",106,"2.1.1 Винахідницька робота викладача: міжнародні патенти"]
["2.1.2","Винахідницька робота викладача: патенти",107,"2.1.2 Винахідницька робота викладача: патенти"]
["2.1.3","Винахідницька робота викладача:  патенти на корисну модель",108,"2.1.3 Винахідницька робота викладача:  патенти на корисну модель"]
{"$rows_left_out":48}
{"sheet":"органз","index":7,"n_rows":74,"n_cols":4,"rows_kept":74,"cut":false,"hidden":false,"merged":[]}
[]
["ПП","ПЕРЕЛІК ОРГАНІЗАЦІЙНИХ РОБІТ","номер"]
[]
[]
[]
[]
[]
[]
[]
[]
[]
[]
["ПП","ПЕРЕЛІК ОРГАНІЗАЦІЙНИХ РОБІТ","номер"]
["1.1.1","Робота в експертній раді МОН України:  (акредитація та ліцензування, наукові ступені)",156,{"$f":"CONCATENATE(A14,\" \", B14)","v":"1.1.1 Робота в експертній раді МОН України:  (акредитація та ліцензування, наукові ступені)"}]
["1.1.2","Робота в експертних радах міністерств та відомств ",157,{"$f":"CONCATENATE(A15,\" \", B15)","v":"1.1.2 Робота в експертних радах міністерств та відомств "}]
["1.1.3","Робота в колегіях МОН України (загальна участь, участь у проведенні атестацій)",158,"1.1.3 Робота в колегіях МОН України (загальна участь, участь у проведенні атестацій)"]
["1.1.4","Робота в науково-методичних комісіях ",159,"1.1.4 Робота в науково-методичних комісіях "]
["1.1.5","Робота в робочих групах міністерств ",160,"1.1.5 Робота в робочих групах міністерств "]
["1.1.6","Робота в колегіях облдержадміністрації",161,"1.1.6 Робота в колегіях облдержадміністрації"]
["1.1.7","Робота в комітетах різних рівнів ",162,"1.1.7 Робота в комітетах різних рівнів "]
{"$rows_left_out":55}
{"sheet":"СПИСКИ","index":8,"n_rows":32,"n_cols":11,"rows_kept":32,"cut":false,"hidden":true,"merged":[]}
["ФАКУЛЬТЕТИ","код","Декани","код","КАФЕДРИ","Завідувачі кафедр","ПОСАДИ","ВЧЕНЕ ЗВАННЯ","Примітка","Підсумковий результат ","Термін виконання"]
[]
["Міжнародних відносин і журналістики",101,"Птащенко О.В.",101,"Міжнародних економічних відносин","Отенко І.П.","Завідувач кафедри","Професор","Зовнішній сумісник","Друкована праця","I семестр"]
["Фінансів і обліку",201,"Проноза П.В.",102,"Управління соціальними комунікаціями","Яресько К.В.","Професор","Доцент","Внутрішній сумісник","Рукопис","II семестр"]
["Менеджменту і маркетингу",301,"Вовк В.А.",103,"Міжнародних відносин, політичних наук і практичної філософії","Кузь О.М.","Доцент","Старший науковий співробітник",null,null,"Протягом року"]
["Інформаційних технологій",401,"Коц Г.П.",104,"Педагогіки, іноземної філології та переводу","Борова Т.А.","Старший викладач","Старший дослідник"]
["Економіки і права",501,"Бріль М.С.",201,"Фінансів","Журавльова І.В.","Викладач"]
["Міжнародної економіки і підприємництва",601,"Шталь Т.В.",202,"Банківської справи і фінансових послуг","Колодізєв О.М."]
["Підготовки іноземних громадян",701,"Єрмоленко О.А.",203,"Митної справи","Тищенко В.Ф."]
[null,null,null,204,"Обліку і бізнес-консалтингу","Пилипенко А.А."]
[null,null,null,205,"Вищої математики та економіко-математичних методів","Малярець Л.М."]
[null,null,null,301,"Менеджменту, логістики та інновацій","Ястремська О.М."]
[null,null,null,302,"Менеджменту та бізнесу","Лепейко Т.І."]
[null,null,null,303,"Маркетингу","Гриневич Л.В."]
[null,null,null,401,"Інформаційних систем","Ушакова І.О."]
[null,null,null,402,"Комп’ютерних систем і технологій ","Пушкар О.І."]
[null,null,null,403,"Економічної кібернетики і системного аналізу","Гур’янова Л.С."]
[null,null,null,404,"Інформатики та комп’ютерної техніки ","Удовенко С.Г."]
[null,null,null,405,"Кібербезпеки та інформаційних технологій","Євсеєв С.П."]
[null,null,null,506,"Статистики і економічного прогнозування","Раєвнєва О.В."]
{"$rows_left_out":13}
{"sheet":"Лист2","index":9,"n_rows":0,"n_cols":0,"rows_kept":0,"cut":false,"hidden":true,"merged":[]}

{"sheet":"Лист3","index":10,"n_rows":0,"n_cols":0,"rows_kept":0,"cut":false,"hidden":true,"merged":[]}

{"sheet":"Лист4","index":11,"n_rows":0,"n_cols":0,"rows_kept":0,"cut":false,"hidden":true,"merged":[]}